{"text_format":"1","workbook":"xlsx","n_sheets":5,"sheets":["Welcome","Submission Form","Settings","LibraryTypes","Thousands"],"not_rendered":{"charts":0,"images":3,"macros":1,"external_links":0,"defined_names":60,"comments":0,"pivot_tables":0},"unopened":[],"bounds":{"document_bytes":16777216,"sheet_cells":100000,"rows_first":2000,"rows_last":500,"rows_between":2000,"halvings":0,"cell_chars":16384,"cell_head_chars":4096},"cells_cut":0,"cells_raw":0,"read":"whole","date_system":"1900"}

{"sheet":"Welcome","index":0,"n_rows":0,"n_cols":0,"rows_kept":0,"cut":false,"hidden":false,"merged":[]}

{"sheet":"Submission Form","index":1,"n_rows":417,"n_cols":19,"rows_kept":417,"cut":false,"hidden":true,"merged":[[13,5,14,5],[13,6,14,6],[13,7,14,7],[13,8,14,8],[13,9,14,9],[1,0,1,4],[3,0,3,1],[13,1,14,1],[13,2,14,2],[13,3,14,3],[13,4,14,4],[13,12,14,12],[13,13,14,13],[14,14,14,16],[3,8,3,10],[1,8,1,10],[13,10,14,10],[13,11,14,11]]}
["10x",1.5]
["Crown Institute for Genomics:   Single Cell Suspension Sample Submission Form",null,null,null,null,null,null,null,"Can only be filled with Office 365"]
["Fields marked in * are required"]
["Complete the information in the red/light blue fields and in continuous rows",null,null,null,null,"INCPM number","for internal use",null,"Incomplete Fields/Errors Detected"]
[]
["Order & user details:"]
["*Researcher first and last name",null,"No more than a single space allowed!"]
["*Lab PI first and last name",null,"No more than a single space allowed!"]
["*Researcher mobile phone number",null,"e.g. 054-1234567 or 0541234567"]
["*Researcher E-Mail address",null,"A valid email address shall be entered"]
["*Institute "]
["*INCPM Bioinformatics Analysis"]
[]
[null,"Up to 15 characters unique name with\nletters, digits, \"-\"s, \"+\"s, or \"_\"s","A value in the drop-down list",null,"A value in the drop-down list","A value in the drop-down list",null,null,null,"A value in the drop-down list.\nIn case of 'other', specify in the Comments.",null,"A value in the drop-down list","A value in the drop-down list","A value in the drop-down list"]
["10X_Genomics and NGS Run details:",null,null,null,null,null,null,null,null,null,null,null,null,null,"A decimal value greater than 0, to be filled on the day of the experiment"]
["Sample No. (as written on the side of the tube) ","*Sample name","*Library type","Item description","*Extension","*Targeted number of cells","*Cell type","*Species","Cell isolation method","*Final cell suspension","Method of counting","*Illumina sequencer and run mode","*Read type & length","*Number of Kits","*Cell con. (cell/ul)","*Estimated viability (%)","*Vol. (ul)","Comments","Suffix"]
[1,null,null,{"$f":"_xlfn.IFNA(_xlfn.TEXTJOIN(\"; \",TRUE,INDEX(ItemDescriptionsTable[#Data],,MATCH($C17, ItemDescriptionsTable[#Headers], 0))),\"\")","v":""},null,null,null,null,null,null,null,null,null,null,null,null,null,null,{"$f":"_xlfn.LET(_xlpm.col,IF(NOT(OR(IsEmpty($B17),IsEmpty($C17),IsEmpty($E17))),MATCH($C17,ExtensionsTable[#Headers],0),\"\"),\n_xlpm.row,IF(_xlpm.col=\"\",\"\",ROW(INDEX(ExtensionsTable[], MATCH($E17, INDEX(ExtensionsTable[], , _xlpm.col), 0), 1))-ROW(ExtensionsTable[[#Headers],[Gene Expression ]])),\nIF(OR(_xlpm.col=\"\",_xlpm.row=\"\"),\"\",INDEX(SuffixesTable[], _xlpm.row, _xlpm.col)))","v":""}]
[2,null,null,{"$f":"_xlfn.IFNA(_xlfn.TEXTJOIN(\"; \",TRUE,INDEX(ItemDescriptionsTable[#Data],,MATCH($C18, ItemDescriptionsTable[#Headers], 0))),\"\")","v":""},null,null,null,null,null,null,null,null,null,null,null,null,null,null,{"$f":"_xlfn.LET(_xlpm.col,IF(NOT(OR(IsEmpty($B18),IsEmpty($C18),IsEmpty($E18))),MATCH($C18,ExtensionsTable[#Headers],0),\"\"),\n_xlpm.row,IF(_xlpm.col=\"\",\"\",ROW(INDEX(ExtensionsTable[], MATCH($E18, INDEX(ExtensionsTable[], , _xlpm.col), 0), 1))-ROW(ExtensionsTable[[#Headers],[Gene Expression ]])),\nIF(OR(_xlpm.col=\"\",_xlpm.row=\"\"),\"\",INDEX(SuffixesTable[], _xlpm.row, _xlpm.col)))","v":""}]
[3,null,null,{"$f":"_xlfn.IFNA(_xlfn.TEXTJOIN(\"; \",TRUE,INDEX(ItemDescriptionsTable[#Data],,MATCH($C19, ItemDescriptionsTable[#Headers], 0))),\"\")","v":""},null,null,null,null,null,null,null,null,null,null,null,null,null,null,{"$f":"_xlfn.LET(_xlpm.col,IF(NOT(OR(IsEmpty($B19),IsEmpty($C19),IsEmpty($E19))),MATCH($C19,ExtensionsTable[#Headers],0),\"\"),\n_xlpm.row,IF(_xlpm.col=\"\",\"\",ROW(INDEX(ExtensionsTable[], MATCH($E19, INDEX(ExtensionsTable[], , _xlpm.col), 0), 1))-ROW(ExtensionsTable[[#Headers],[Gene Expression ]])),\nIF(OR(_xlpm.col=\"\",_xlpm.row=\"\"),\"\",INDEX(SuffixesTable[], _xlpm.row, _xlpm.col)))","v":""}]
[4,null,null,{"$f":"_xlfn.IFNA(_xlfn.TEXTJOIN(\"; \",TRUE,INDEX(ItemDescriptionsTable[#Data],,MATCH($C20, ItemDescriptionsTable[#Headers], 0))),\"\")","v":""},null,null,null,null,null,null,null,null,null,null,null,null,null,null,{"$f":"_xlfn.LET(_xlpm.col,IF(NOT(OR(IsEmpty($B20),IsEmpty($C20),IsEmpty($E20))),MATCH($C20,ExtensionsTable[#Headers],0),\"\"),\n_xlpm.row,IF(_xlpm.col=\"\",\"\",ROW(INDEX(ExtensionsTable[], MATCH($E20, INDEX(ExtensionsTable[], , _xlpm.col), 0), 1))-ROW(ExtensionsTable[[#Headers],[Gene Expression ]])),\nIF(OR(_xlpm.col=\"\",_xlpm.row=\"\"),\"\",INDEX(SuffixesTable[], _xlpm.row, _xlpm.col)))","v":""}]
[5,null,null,{"$f":"_xlfn.IFNA(_xlfn.TEXTJOIN(\"; \",TRUE,INDEX(ItemDescriptionsTable[#Data],,MATCH($C21, ItemDescriptionsTable[#Headers], 0))),\"\")","v":""},null,null,null,null,null,null,null,null,null,null,null,null,null,null,{"$f":"_xlfn.LET(_xlpm.col,IF(NOT(OR(IsEmpty($B21),IsEmpty($C21),IsEmpty($E21))),MATCH($C21,ExtensionsTable[#Headers],0),\"\"),\n_xlpm.row,IF(_xlpm.col=\"\",\"\",ROW(INDEX(ExtensionsTable[], MATCH($E21, INDEX(ExtensionsTable[], , _xlpm.col), 0), 1))-ROW(ExtensionsTable[[#Headers],[Gene Expression ]])),\nIF(OR(_xlpm.col=\"\",_xlpm.row=\"\"),\"\",INDEX(SuffixesTable[], _xlpm.row, _xlpm.col)))","v":""}]
[6,null,null,{"$f":"_xlfn.IFNA(_xlfn.TEXTJOIN(\"; \",TRUE,INDEX(ItemDescriptionsTable[#Data],,MATCH($C22, ItemDescriptionsTable[#Headers], 0))),\"\")","v":""},null,null,null,null,null,null,null,null,null,null,null,null,null,null,{"$f":"_xlfn.LET(_xlpm.col,IF(NOT(OR(IsEmpty($B22),IsEmpty($C22),IsEmpty($E22))),MATCH($C22,ExtensionsTable[#Headers],0),\"\"),\n_xlpm.row,IF(_xlpm.col=\"\",\"\",ROW(INDEX(ExtensionsTable[], MATCH($E22, INDEX(ExtensionsTable[], , _xlpm.col), 0), 1))-ROW(ExtensionsTable[[#Headers],[Gene Expression ]])),\nIF(OR(_xlpm.col=\"\",_xlpm.row=\"\"),\"\",INDEX(SuffixesTable[], _xlpm.row, _xlpm.col)))","v":""}]
[7,null,null,{"$f":"_xlfn.IFNA(_xlfn.TEXTJOIN(\"; \",TRUE,INDEX(ItemDescriptionsTable[#Data],,MATCH($C23, ItemDescriptionsTable[#Headers], 0))),\"\")","v":""},null,null,null,null,null,null,null,null,null,null,null,null,null,null,{"$f":"_xlfn.LET(_xlpm.col,IF(NOT(OR(IsEmpty($B23),IsEmpty($C23),IsEmpty($E23))),MATCH($C23,ExtensionsTable[#Headers],0),\"\"),\n_xlpm.row,IF(_xlpm.col=\"\",\"\",ROW(INDEX(ExtensionsTable[], MATCH($E23, INDEX(ExtensionsTable[], , _xlpm.col), 0), 1))-ROW(ExtensionsTable[[#Headers],[Gene Expression ]])),\nIF(OR(_xlpm.col=\"\",_xlpm.row=\"\"),\"\",INDEX(SuffixesTable[], _xlpm.row, _xlpm.col)))","v":""}]
[8,null,null,{"$f":"_xlfn.IFNA(_xlfn.TEXTJOIN(\"; \",TRUE,INDEX(ItemDescriptionsTable[#Data],,MATCH($C24, ItemDescriptionsTable[#Headers], 0))),\"\")","v":""},null,null,null,null,null,null,null,null,null,null,null,null,null,null,{"$f":"_xlfn.LET(_xlpm.col,IF(NOT(OR(IsEmpty($B24),IsEmpty($C24),IsEmpty($E24))),MATCH($C24,ExtensionsTable[#Headers],0),\"\"),\n_xlpm.row,IF(_xlpm.col=\"\",\"\",ROW(INDEX(ExtensionsTable[], MATCH($E24, INDEX(ExtensionsTable[], , _xlpm.col), 0), 1))-ROW(ExtensionsTable[[#Headers],[Gene Expression ]])),\nIF(OR(_xlpm.col=\"\",_xlpm.row=\"\"),\"\",INDEX(SuffixesTable[], _xlpm.row, _xlpm.col)))","v":""}]
[9,null,null,{"$f":"_xlfn.IFNA(_xlfn.TEXTJOIN(\"; \",TRUE,INDEX(ItemDescriptionsTable[#Data],,MATCH($C25, ItemDescriptionsTable[#Headers], 0))),\"\")","v":""},null,null,null,null,null,null,null,null,null,null,null,null,null,null,{"$f":"_xlfn.LET(_xlpm.col,IF(NOT(OR(IsEmpty($B25),IsEmpty($C25),IsEmpty($E25))),MATCH($C25,ExtensionsTable[#Headers],0),\"\"),\n_xlpm.row,IF(_xlpm.col=\"\",\"\",ROW(INDEX(ExtensionsTable[], MATCH($E25, INDEX(ExtensionsTable[], , _xlpm.col), 0), 1))-ROW(ExtensionsTable[[#Headers],[Gene Expression ]])),\nIF(OR(_xlpm.col=\"\",_xlpm.row=\"\"),\"\",INDEX(SuffixesTable[], _xlpm.row, _xlpm.col)))","v":""}]
[10,null,null,{"$f":"_xlfn.IFNA(_xlfn.TEXTJOIN(\"; \",TRUE,INDEX(ItemDescriptionsTable[#Data],,MATCH($C26, ItemDescriptionsTable[#Headers], 0))),\"\")","v":""},null,null,null,null,null,null,null,null,null,null,null,null,null,null,{"$f":"_xlfn.LET(_xlpm.col,IF(NOT(OR(IsEmpty($B26),IsEmpty($C26),IsEmpty($E26))),MATCH($C26,ExtensionsTable[#Headers],0),\"\"),\n_xlpm.row,IF(_xlpm.col=\"\",\"\",ROW(INDEX(ExtensionsTable[], MATCH($E26, INDEX(ExtensionsTable[], , _xlpm.col), 0), 1))-ROW(ExtensionsTable[[#Headers],[Gene Expression ]])),\nIF(OR(_xlpm.col=\"\",_xlpm.row=\"\"),\"\",INDEX(SuffixesTable[], _xlpm.row, _xlpm.col)))","v":""}]
[11,null,null,{"$f":"_xlfn.IFNA(_xlfn.TEXTJOIN(\"; \",TRUE,INDEX(ItemDescriptionsTable[#Data],,MATCH($C27, ItemDescriptionsTable[#Headers], 0))),\"\")","v":""},null,null,null,null,null,null,null,null,null,null,null,null,null,null,{"$f":"_xlfn.LET(_xlpm.col,IF(NOT(OR(IsEmpty($B27),IsEmpty($C27),IsEmpty($E27))),MATCH($C27,ExtensionsTable[#Headers],0),\"\"),\n_xlpm.row,IF(_xlpm.col=\"\",\"\",ROW(INDEX(ExtensionsTable[], MATCH($E27, INDEX(ExtensionsTable[], , _xlpm.col), 0), 1))-ROW(ExtensionsTable[[#Headers],[Gene Expression ]])),\nIF(OR(_xlpm.col=\"\",_xlpm.row=\"\"),\"\",INDEX(SuffixesTable[], _xlpm.row, _xlpm.col)))","v":""}]
[12,null,null,{"$f":"_xlfn.IFNA(_xlfn.TEXTJOIN(\"; \",TRUE,INDEX(ItemDescriptionsTable[#Data],,MATCH($C28, ItemDescriptionsTable[#Headers], 0))),\"\")","v":""},null,null,null,null,null,null,null,null,null,null,null,null,null,null,{"$f":"_xlfn.LET(_xlpm.col,IF(NOT(OR(IsEmpty($B28),IsEmpty($C28),IsEmpty($E28))),MATCH($C28,ExtensionsTable[#Headers],0),\"\"),\n_xlpm.row,IF(_xlpm.col=\"\",\"\",ROW(INDEX(ExtensionsTable[], MATCH($E28, INDEX(ExtensionsTable[], , _xlpm.col), 0), 1))-ROW(ExtensionsTable[[#Headers],[Gene Expression ]])),\nIF(OR(_xlpm.col=\"\",_xlpm.row=\"\"),\"\",INDEX(SuffixesTable[], _xlpm.row, _xlpm.col)))","v":""}]
[13,null,null,{"$f":"_xlfn.IFNA(_xlfn.TEXTJOIN(\"; \",TRUE,INDEX(ItemDescriptionsTable[#Data],,MATCH($C29, ItemDescriptionsTable[#Headers], 0))),\"\")","v":""},null,null,null,null,null,null,null,null,null,null,null,null,null,null,{"$f":"_xlfn.LET(_xlpm.col,IF(NOT(OR(IsEmpty($B29),IsEmpty($C29),IsEmpty($E29))),MATCH($C29,ExtensionsTable[#Headers],0),\"\"),\n_xlpm.row,IF(_xlpm.col=\"\",\"\",ROW(INDEX(ExtensionsTable[], MATCH($E29, INDEX(ExtensionsTable[], , _xlpm.col), 0), 1))-ROW(ExtensionsTable[[#Headers],[Gene Expression ]])),\nIF(OR(_xlpm.col=\"\",_xlpm.row=\"\"),\"\",INDEX(SuffixesTable[], _xlpm.row, _xlpm.col)))","v":""}]
[14,null,null,{"$f":"_xlfn.IFNA(_xlfn.TEXTJOIN(\"; \",TRUE,INDEX(ItemDescriptionsTable[#Data],,MATCH($C30, ItemDescriptionsTable[#Headers], 0))),\"\")","v":""},null,null,null,null,null,null,null,null,null,null,null,null,null,null,{"$f":"_xlfn.LET(_xlpm.col,IF(NOT(OR(IsEmpty($B30),IsEmpty($C30),IsEmpty($E30))),MATCH($C30,ExtensionsTable[#Headers],0),\"\"),\n_xlpm.row,IF(_xlpm.col=\"\",\"\",ROW(INDEX(ExtensionsTable[], MATCH($E30, INDEX(ExtensionsTable[], , _xlpm.col), 0), 1))-ROW(ExtensionsTable[[#Headers],[Gene Expression ]])),\nIF(OR(_xlpm.col=\"\",_xlpm.row=\"\"),\"\",INDEX(SuffixesTable[], _xlpm.row, _xlpm.col)))","v":""}]
{"$rows_left_out":388}
{"sheet":"Settings","index":2,"n_rows":22,"n_cols":26,"rows_kept":22,"cut":false,"hidden":true,"merged":[]}
["Institute ","INCPM Bioinformatics Analysis","Library Type","illumina Sequencer and Run Mode","Measured by","Kits","NextSeq Kits","Library Type","*RNA preparation protocol","Final cell suspension","Output of cells","MiSeq","NextSeq High Output","NextSeq Mid Output","NovaSeq X Plus 1.5B","NovaSeq X Plus 10B","NovaSeq X Plus 25B","Not yet determined",null,null,null,null,null,null,null,"ValidPhoneNumber"]
["ARO- Volcani","Yes","INCPM mRNA Seq","NovaSeq X Plus 1.5B","Qubit",1,0.5,"10x genomics","Direct-zol™ RNA MiniPrep, Zymo Research","PBS+0.04%BSA",1000,"V2_50 cycles","NextSeq 75 cycles","NextSeq 150 cycles","NovaSeq X Plus 100 cycles","NovaSeq X Plus 100 cycles","NovaSeq X Plus 100 cycles","Not yet determined",null,null,null,null,null,null,null,{"$f":"IsLocalPhoneNumber('Submission Form'!$B$9)","v":false}]
["Barzilai Medical Center","No","INCPM mRNA Seq w/o PolyA Capture","Not yet determined","Nanodrop",2,1,null,"Direct-zol™-96 RNA, Zymo Research","Other, specify in the comment",2000,"V2_ 300 cycles","NextSeq 150 cycles","NextSeq 300 cycles "]
["BGU",null,"SMARTer Ultra Low Input RNA",null,null,"Not yet determined",2,null,"EZ-RNA Total RNA Isolation Kit, Biological Industries",null,3000,"V2_500 cycles","NextSeq 300 cycles"]
["BIU",null,"TruSeq mRNA",null,null,null,"Not yet determined",null,"GenElute Mammalian Total RNA Miniprep Kit, Sigma-Aldrich",null,4000,"V3_150 cycles"]
["DSASC",null,"TruSeq mRNA w/o PolyA Capture",null,null,null,null,null,"miRNeasy Micro Kit, Qiagen",null,5000,"V3_600 cycles"]
["Hadassah Medical Center",null,"TruSeq Small RNA",null,null,null,null,null,"miRNeasy Mini Kit, Qiagen",null,6000,"MicroV2_300 cycles"]
["Haifa Medical Center ",null,"TruSeq Stranded mRNA",null,null,null,null,null,"NucleoSpin® RNA, MACHEREY-NAGEL",null,7000,"NanoV2_300 cycles"]
["Haifa University",null,"TruSeq Stranded Total RNA   ",null,null,null,null,null,"PerfectPure RNA Cultured Cell Kit, 5 PRIME",null,8000,"NanoV2_500 cycles"]
["HUJI",null,null,null,null,null,null,null,"PerfectPure RNA Tissue Kit, 5 PRIME",null,9000]
["HUJI (Faculty)",null,null,null,null,null,null,null,"QIAzol Lysis Reagent, Qiagen",null,10000]
["Ichilov Medical Center",null,null,null,null,null,null,null,"RNeasy Micro Kit, Qiagen",null,11000]
["IIBR",null,null,null,null,null,null,null,"RNeasy Mini Kit, Qiagen",null,12000]
["Kaplan Medical Center",null,null,null,null,null,null,null,"RNeasy Plant Mini Kit, Qiagen",null,13000]
["Rabin Medical Center",null,null,null,null,null,null,null,"Spectrum Plant Total RNA Kit, Sigma-Aldrich",null,14000]
["Schneider Medical Center",null,null,null,null,null,null,null,"SV Total RNA Isolation System, Promega",null,15000]
["Sheba Medical Center",null,null,null,null,null,null,null,"Synthetic, IDT",null,16000]
["TAU",null,null,null,null,null,null,null,"TRI Reagent, Molecular Research Center",null,17000]
["Technion",null,null,null,null,null,null,null,"TRI Reagent®, Sigma-Aldrich",null,18000]
["Veterinary",null,null,null,null,null,null,null,"TRIzol® Reagent, Life Technologies",null,19000]
["WIS",null,null,null,null,null,null,null,"Other- Type here",null,20000]
["Other- Type here"]

{"sheet":"LibraryTypes","index":3,"n_rows":53,"n_cols":15,"rows_kept":53,"cut":false,"hidden":true,"merged":[]}
[null,"Item Description"]
["LibraryType","Gene Expression ","Immune Profiling and Gene Expression","CRISPR and Gene Expression","Flex Gene Expression (Fixed)","Multiome","On Chip Multiplexing_3'","On Chip Multiplexing_5'","ATAC",null,null,null,null,null,"Gene Expression "]
[null,"10x_Gene_Expression-3'_INCPM","10x_Immune_Profiling_INCPM","10x_Gene_Expression_5'_INCPM_and_CRISPR","Single-cell_Flex_INCPM","Single-cell_Multiome (Gene expression + ATAC)","On-Chip_Multiplexing_Gene_Expression_3'","On-Chip _Multiplexing_Gene_Expression_5'","None",null,null,null,null,null,"Immune Profiling and Gene Expression"]
[null,null,"10x_Gene_Expression_5'_INCPM",null,null,null,null,null,null,null,null,null,null,null,"CRISPR and Gene Expression"]
[null,null,null,null,null,null,null,null,null,null,null,null,null,null,"Flex Gene Expression (Fixed)"]
[null,null,null,null,null,null,null,null,null,null,null,null,null,null,"Multiome"]
[null,"Extension",null,null,null,null,null,null,null,null,null,null,null,null,"On Chip Multiplexing_3'"]
["LibraryType","Gene Expression ","Immune Profiling and Gene Expression","CRISPR and Gene Expression","Flex Gene Expression (Fixed)","Multiome","On Chip Multiplexing_3'","On Chip Multiplexing_5'","ATAC",null,null,null,null,null,"On Chip Multiplexing_5'"]
[null,"None","None","CRISPR","Single Plex","None","None","None","None",null,null,null,null,null,"ATAC"]
[null,"Cell surface Protein","BCR",null,"4-Plex",null,"Cell surface Protein","Cell surface Protein"]
[null,null,"TCR",null,"Single Plex_Cell Surface Protein",null,null,"CRISPR"]
[null,null,"BCR + TCR",null,"4-Plex_Cell Surface Protein",null,null,"TCR"]
[null,null,null,null,"Single Plex_CRISPR",null,null,"BCR"]
[null,null,null,null,"4-Plex_CRISPR",null,null,"BCR + TCR"]
[]
[]
[null,"Targeted Number of Cells"]
["LibraryType","Gene Expression ","Immune Profiling and Gene Expression","CRISPR and Gene Expression","Flex Gene Expression (Fixed)","Multiome","On Chip Multiplexing_3'","On Chip Multiplexing_5'","ATAC"]
[null,20000,20000,20000,20000,10000,5000,5000,10000]
[]
[]
[null,"# LB's per sample"]
["LibraryType","Gene Expression ","Immune Profiling and Gene Expression","CRISPR and Gene Expression","Flex Gene Expression (Fixed)","Multiome","On Chip Multiplexing_3'","On Chip Multiplexing_5'","ATAC"]
[null,1,1,2,1,2,1,1,1]
[null,2,2,null,1,null,2,2]
[null,null,2,null,2,null,null,2]
[null,null,3,null,2,null,null,2]
[null,null,null,null,2,null,null,2]
[null,null,null,null,2,null,null,3]
[]
{"$rows_left_out":24}
{"sheet":"Thousands","index":4,"n_rows":416,"n_cols":1,"rows_kept":416,"cut":false,"hidden":true,"merged":[]}
[]
[]
[]
[]
[]
[]
[]
[]
[]
[]
[]
[]
[]
[]
[]
[]
[{"$f":"IFERROR(_xlfn.TOROW(ThousandsList(_xlfn.XLOOKUP('Submission Form'!$C17,LibraryTypes,LibraryTypes!$B$19:$I$19,\"\"))),\"\")","v":""}]
[{"$f":"IFERROR(_xlfn.TOROW(ThousandsList(_xlfn.XLOOKUP('Submission Form'!$C18,LibraryTypes,LibraryTypes!$B$19:$I$19,\"\"))),\"\")","v":""}]
[{"$f":"IFERROR(_xlfn.TOROW(ThousandsList(_xlfn.XLOOKUP('Submission Form'!$C19,LibraryTypes,LibraryTypes!$B$19:$I$19,\"\"))),\"\")","v":""}]
[{"$f":"IFERROR(_xlfn.TOROW(ThousandsList(_xlfn.XLOOKUP('Submission Form'!$C20,LibraryTypes,LibraryTypes!$B$19:$I$19,\"\"))),\"\")","v":""}]
[{"$f":"IFERROR(_xlfn.TOROW(ThousandsList(_xlfn.XLOOKUP('Submission Form'!$C21,LibraryTypes,LibraryTypes!$B$19:$I$19,\"\"))),\"\")","v":""}]
[{"$f":"IFERROR(_xlfn.TOROW(ThousandsList(_xlfn.XLOOKUP('Submission Form'!$C22,LibraryTypes,LibraryTypes!$B$19:$I$19,\"\"))),\"\")","v":""}]
[{"$f":"IFERROR(_xlfn.TOROW(ThousandsList(_xlfn.XLOOKUP('Submission Form'!$C23,LibraryTypes,LibraryTypes!$B$19:$I$19,\"\"))),\"\")","v":""}]
[{"$f":"IFERROR(_xlfn.TOROW(ThousandsList(_xlfn.XLOOKUP('Submission Form'!$C24,LibraryTypes,LibraryTypes!$B$19:$I$19,\"\"))),\"\")","v":""}]
[{"$f":"IFERROR(_xlfn.TOROW(ThousandsList(_xlfn.XLOOKUP('Submission Form'!$C25,LibraryTypes,LibraryTypes!$B$19:$I$19,\"\"))),\"\")","v":""}]
[{"$f":"IFERROR(_xlfn.TOROW(ThousandsList(_xlfn.XLOOKUP('Submission Form'!$C26,LibraryTypes,LibraryTypes!$B$19:$I$19,\"\"))),\"\")","v":""}]
[{"$f":"IFERROR(_xlfn.TOROW(ThousandsList(_xlfn.XLOOKUP('Submission Form'!$C27,LibraryTypes,LibraryTypes!$B$19:$I$19,\"\"))),\"\")","v":""}]
[{"$f":"IFERROR(_xlfn.TOROW(ThousandsList(_xlfn.XLOOKUP('Submission Form'!$C28,LibraryTypes,LibraryTypes!$B$19:$I$19,\"\"))),\"\")","v":""}]
[{"$f":"IFERROR(_xlfn.TOROW(ThousandsList(_xlfn.XLOOKUP('Submission Form'!$C29,LibraryTypes,LibraryTypes!$B$19:$I$19,\"\"))),\"\")","v":""}]
[{"$f":"IFERROR(_xlfn.TOROW(ThousandsList(_xlfn.XLOOKUP('Submission Form'!$C30,LibraryTypes,LibraryTypes!$B$19:$I$19,\"\"))),\"\")","v":""}]
{"$rows_left_out":386}