{"text_format":"1","workbook":"xlsx","n_sheets":3,"sheets":["Welcome","Submission Form","PlateMap"],"not_rendered":{"charts":0,"images":0,"macros":1,"external_links":1,"defined_names":30,"comments":0,"pivot_tables":0},"unopened":[],"bounds":{"document_bytes":16777216,"sheet_cells":100000,"rows_first":2000,"rows_last":500,"rows_between":2000,"halvings":0,"cell_chars":16384,"cell_head_chars":4096},"cells_cut":0,"cells_raw":0,"read":"whole","date_system":"1900"}

{"sheet":"Welcome","index":0,"n_rows":0,"n_cols":0,"rows_kept":0,"cut":false,"hidden":false,"merged":[]}

{"sheet":"Submission Form","index":1,"n_rows":418,"n_cols":25,"rows_kept":418,"cut":false,"hidden":true,"merged":[[5,5,5,6]]}
["dna",1.4]
["Crown Institute for Genomics: DNA Sample Submission Form",null,null,null,null,"INCPMPM number","for internal use"]
[]
["Comlete the information in the light blue fields"]
["Fields marked in * are required","errors markers",null,null,null,"Legend"]
["sample name must be uniqe","error markers",null,null,null,"Out of recommended range value"]
[]
["Order & user details:"]
["*Researcher first and last name"]
["*Lab PI first and last name"]
["*Researcher mobile phone number"]
["*Researcher E-Mail address"]
["*Institute "]
["*INCPM Bioinformatics Analysis"]
["*Plate or Tubes"]
[]
["DNA sample and NGS run details:"]
["Sample No. (as written on the side of the tube) ","Well (if relevant)","*Sample name","*Concentration (ng/ul)","*Measured by","*Vol. (ul)","OD: 260/280","OD: 260/230","*Origin of sample","*Species","*Library type","*Illumina sequencer and run mode","*Read type & length","*Single or Paired End","*Number of Kits","PhiX[%]","Comments"]
[1,"A1"]
[2,"B1"]
[3,"C1",null,null,null,null,null,null,null,null,null,null,null,null,null,null,null,null,null,"*DNA preparation protocol",null,null,"Library Type","illumina Sequencer and Run Mode","Institute "]
[4,"D1",null,null,null,null,null,null,null,null,null,null,null,null,null,null,null,null,null,"Chromatin Immunoprecipitation",null,null,"INCPM DNA Seq","MiSeq","ARO- Volcani"]
[5,"E1",null,null,null,null,null,null,null,null,null,null,null,null,null,null,null,null,null,"Cut and Run",null,null,"INCPM ChIP Seq","NextSeq High Output","Barzilai Medical Center"]
[6,"F1",null,null,null,null,null,null,null,null,null,null,null,null,null,null,null,null,null,"Genome",null,null,"INCPM Amplicon Seq","NextSeq Mid Output","BGU"]
[7,"G1",null,null,null,null,null,null,null,null,null,null,null,null,null,null,null,null,null,"PCR product",null,null,"RRBS","NovaSeq X Plus 1.5B","BIU"]
[8,"H1",null,null,null,null,null,null,null,null,null,null,null,null,null,null,null,null,null,"Other-Type here",null,null,null,"NovaSeq X Plus 10B","DSASC"]
[9,"A2",null,null,null,null,null,null,null,null,null,null,null,null,null,null,null,null,null,null,null,null,null,"NovaSeq X Plus 25B","Hadassah Medical Center"]
[10,"B2",null,null,null,null,null,null,null,null,null,null,null,null,null,null,null,null,null,null,null,null,null,"Not yet determined","Haifa Medical Center "]
[11,"C2",null,null,null,null,null,null,null,null,null,null,null,null,null,null,null,null,null,null,null,null,null,null,"Haifa University"]
[12,"D2",null,null,null,null,null,null,null,null,null,null,null,null,null,null,null,null,null,null,null,"Measured by",null,null,"HUJI"]
[13,"E2",null,null,null,null,null,null,null,null,null,null,null,null,null,null,null,null,null,null,null,"Qubit",null,null,"HUJI (Faculty)"]
[14,"F2",null,null,null,null,null,null,null,null,null,null,null,null,null,null,null,null,null,null,null,"Nanodrop",null,null,"Ichilov Medical Center"]
[15,"G2",null,null,null,null,null,null,null,null,null,null,null,null,null,null,null,null,null,null,null,null,null,null,"Rabin Medical Center"]
[16,"H2",null,null,null,null,null,null,null,null,null,null,null,null,null,null,null,null,null,null,null,null,null,"MiSeq","Schneider Medical Center"]
[17,"A3",null,null,null,null,null,null,null,null,null,null,null,null,null,null,null,null,null,null,null,null,null,"V2_50 cycles","Sheba Medical Center"]
[18,"B3",null,null,null,null,null,null,null,null,null,null,null,null,null,null,null,null,null,null,null,null,null,"V2_ 300 cycles","TAU"]
[19,"C3",null,null,null,null,null,null,null,null,null,null,null,null,null,null,null,null,null,null,null,null,null,"V2_500 cycles","Technion"]
[20,"D3",null,null,null,null,null,null,null,null,null,null,null,null,null,null,null,null,null,null,null,null,null,"V3_150 cycles","Veterinary"]
[21,"E3",null,null,null,null,null,null,null,null,null,null,null,null,null,null,null,null,null,null,null,null,null,"V3_600 cycles","WIS"]
[22,"F3",null,null,null,null,null,null,null,null,null,null,null,null,null,null,null,null,null,null,null,null,null,"MicroV2_300 cycles","Other- Type here"]
[23,"G3",null,null,null,null,null,null,null,null,null,null,null,null,null,null,null,null,null,null,null,null,null,"NanoV2_300 cycles"]
[24,"H3",null,null,null,null,null,null,null,null,null,null,null,null,null,null,null,null,null,null,null,null,null,"NanoV2_500 cycles"]
[25,"A4",null,null,null,null,null,null,null,null,null,null,null,null,null,null,null,null,null,null,null,null,null,"Not yet determined"]
[26,"B4"]
[27,"C4"]
[28,"D4",null,null,null,null,null,null,null,null,null,null,null,null,null,null,null,null,null,null,null,null,null,"NextSeq High Output"]
[29,"E4",null,null,null,null,null,null,null,null,null,null,null,null,null,null,null,null,null,null,null,null,null,"NextSeq 75 cycles"]
[30,"F4",null,null,null,null,null,null,null,null,null,null,null,null,null,null,null,null,null,null,null,null,null,"Not yet determined"]
[31,"G4"]
[32,"H4",null,null,null,null,null,null,null,null,null,null,null,null,null,null,null,null,null,null,null,null,null,"NextSeq Mid Output","INCPM Bioinformatics Analysis"]
[33,"A5",null,null,null,null,null,null,null,null,null,null,null,null,null,null,null,null,null,null,null,null,null,"NextSeq 150 cycles","Yes"]
[34,"B5",null,null,null,null,null,null,null,null,null,null,null,null,null,null,null,null,null,null,null,null,null,"NextSeq 300 cycles ","No"]
[35,"C5",null,null,null,null,null,null,null,null,null,null,null,null,null,null,null,null,null,null,null,null,null,"Not yet determined"]
[36,"D5"]
[37,"E5"]
[38,"F5",null,null,null,null,null,null,null,null,null,null,null,null,null,null,null,null,null,null,null,null,null,"NovaSeq X Plus 1.5B","NextSeq Kits"]
[39,"G5",null,null,null,null,null,null,null,null,null,null,null,null,null,null,null,null,null,null,null,null,null,"NovaSeq X Plus 100 cycles",0.5]
[40,"H5",null,null,null,null,null,null,null,null,null,null,null,null,null,null,null,null,null,null,null,null,null,"NovaSeq X Plus 200 cycles",1]
[41,"A6",null,null,null,null,null,null,null,null,null,null,null,null,null,null,null,null,null,null,null,null,null,"NovaSeq X Plus 300 cycles",2]
[42,"B6",null,null,null,null,null,null,null,null,null,null,null,null,null,null,null,null,null,null,null,null,null,"Not yet determined","Not yet determined"]
[43,"C6"]
[44,"D6",null,null,null,null,null,null,null,null,null,null,null,null,null,null,null,null,null,null,null,null,null,"NovaSeq X Plus 10B","Kits"]
[45,"E6",null,null,null,null,null,null,null,null,null,null,null,null,null,null,null,null,null,null,null,null,null,"NovaSeq X Plus 100 cycles",1]
[46,"F6",null,null,null,null,null,null,null,null,null,null,null,null,null,null,null,null,null,null,null,null,null,"NovaSeq X Plus 200 cycles",2]
[47,"G6",null,null,null,null,null,null,null,null,null,null,null,null,null,null,null,null,null,null,null,null,null,"NovaSeq X Plus 300 cycles","Not yet determined"]
[48,"H6",null,null,null,null,null,null,null,null,null,null,null,null,null,null,null,null,null,null,null,null,null,"Not yet determined"]
[49,"A7",null,null,null,null,null,null,null,null,null,null,null,null,null,null,null,null,null,null,null,null,null,null,"Single or PE"]
[50,"B7",null,null,null,null,null,null,null,null,null,null,null,null,null,null,null,null,null,null,null,null,null,"NovaSeq X Plus 25B","Single"]
[51,"C7",null,null,null,null,null,null,null,null,null,null,null,null,null,null,null,null,null,null,null,null,null,"NovaSeq X Plus 300 cycles","Paired End"]
[52,"D7",null,null,null,null,null,null,null,null,null,null,null,null,null,null,null,null,null,null,null,null,null,"Not yet determined","Unknown"]
[53,"E7"]
[54,"F7",null,null,null,null,null,null,null,null,null,null,null,null,null,null,null,null,null,null,null,null,null,"Not yet determined","Plate or Tubes"]
[55,"G7",null,null,null,null,null,null,null,null,null,null,null,null,null,null,null,null,null,null,null,null,null,"Not yet determined","Plate"]
[56,"H7",null,null,null,null,null,null,null,null,null,null,null,null,null,null,null,null,null,null,null,null,null,null,"Tubes"]
[57,"A8",null,null,null,null,null,null,null,null,null,null,null,null,null,null,null,null,null,null,null,null,null,"PacBio"]
[58,"B8",null,null,null,null,null,null,null,null,null,null,null,null,null,null,null,null,null,null,null,null,null,"N/A"]
[59,"C8"]
[60,"D8"]
[61,"E8"]
[62,"F8"]
[63,"G8"]
[64,"H8"]
[65,"A9"]
[66,"B9"]
[67,"C9"]
[68,"D9"]
[69,"E9"]
[70,"F9"]
[71,"G9"]
[72,"H9"]
[73,"A10"]
[74,"B10"]
[75,"C10"]
[76,"D10"]
[77,"E10"]
[78,"F10"]
[79,"G10"]
[80,"H10"]
[81,"A11"]
[82,"B11"]
[83,"C11"]
[84,"D11"]
[85,"E11"]
[86,"F11"]
[87,"G11"]
[88,"H11"]
[89,"A12"]
[90,"B12"]
[91,"C12"]
[92,"D12"]
[93,"E12"]
[94,"F12"]
[95,"G12"]
[96,"H12"]
[97]
[98]
[99]
[100]
[101]
[102]
[103]
[104]
[105]
[106]
[107]
[108]
[109]
[110]
[111]
[112]
[113]
[114]
[115]
[116]
[117]
[118]
[119]
[120]
[121]
[122]
[123]
[124]
[125]
[126]
[127]
[128]
[129]
[130]
[131]
[132]
[133]
[134]
[135]
[136]
[137]
[138]
[139]
[140]
[141]
[142]
[143]
[144]
[145]
[146]
[147]
[148]
[149]
[150]
[151]
[152]
[153]
[154]
[155]
[156]
[157]
[158]
[159]
[160]
[161]
[162]
[163]
[164]
[165]
[166]
[167]
[168]
[169]
[170]
[171]
[172]
[173]
[174]
[175]
[176]
[177]
[178]
[179]
[180]
[181]
[182]
{"$rows_left_out":219}
{"sheet":"PlateMap","index":2,"n_rows":9,"n_cols":13,"rows_kept":9,"cut":false,"hidden":true,"merged":[]}
[null,1,2,3,4,5,6,7,8,9,10,11,12]
["A",{"$f":"_xlfn.LET(_xlpm.v,_xlfn.XLOOKUP($A2&B$1,'Submission Form'!$B$19:$B$114,'Submission Form'!$C$19:$C$114,\"\",0),IF(_xlpm.v=0,\"\",_xlpm.v))","v":""},{"$f":"_xlfn.LET(_xlpm.v,_xlfn.XLOOKUP($A2&C$1,'Submission Form'!$B$19:$B$114,'Submission Form'!$C$19:$C$114,\"\",0),IF(_xlpm.v=0,\"\",_xlpm.v))","v":""},{"$f":"_xlfn.LET(_xlpm.v,_xlfn.XLOOKUP($A2&D$1,'Submission Form'!$B$19:$B$114,'Submission Form'!$C$19:$C$114,\"\",0),IF(_xlpm.v=0,\"\",_xlpm.v))","v":""},{"$f":"_xlfn.LET(_xlpm.v,_xlfn.XLOOKUP($A2&E$1,'Submission Form'!$B$19:$B$114,'Submission Form'!$C$19:$C$114,\"\",0),IF(_xlpm.v=0,\"\",_xlpm.v))","v":""},{"$f":"_xlfn.LET(_xlpm.v,_xlfn.XLOOKUP($A2&F$1,'Submission Form'!$B$19:$B$114,'Submission Form'!$C$19:$C$114,\"\",0),IF(_xlpm.v=0,\"\",_xlpm.v))","v":""},{"$f":"_xlfn.LET(_xlpm.v,_xlfn.XLOOKUP($A2&G$1,'Submission Form'!$B$19:$B$114,'Submission Form'!$C$19:$C$114,\"\",0),IF(_xlpm.v=0,\"\",_xlpm.v))","v":""},{"$f":"_xlfn.LET(_xlpm.v,_xlfn.XLOOKUP($A2&H$1,'Submission Form'!$B$19:$B$114,'Submission Form'!$C$19:$C$114,\"\",0),IF(_xlpm.v=0,\"\",_xlpm.v))","v":""},{"$f":"_xlfn.LET(_xlpm.v,_xlfn.XLOOKUP($A2&I$1,'Submission Form'!$B$19:$B$114,'Submission Form'!$C$19:$C$114,\"\",0),IF(_xlpm.v=0,\"\",_xlpm.v))","v":""},{"$f":"_xlfn.LET(_xlpm.v,_xlfn.XLOOKUP($A2&J$1,'Submission Form'!$B$19:$B$114,'Submission Form'!$C$19:$C$114,\"\",0),IF(_xlpm.v=0,\"\",_xlpm.v))","v":""},{"$f":"_xlfn.LET(_xlpm.v,_xlfn.XLOOKUP($A2&K$1,'Submission Form'!$B$19:$B$114,'Submission Form'!$C$19:$C$114,\"\",0),IF(_xlpm.v=0,\"\",_xlpm.v))","v":""},{"$f":"_xlfn.LET(_xlpm.v,_xlfn.XLOOKUP($A2&L$1,'Submission Form'!$B$19:$B$114,'Submission Form'!$C$19:$C$114,\"\",0),IF(_xlpm.v=0,\"\",_xlpm.v))","v":""},{"$f":"_xlfn.LET(_xlpm.v,_xlfn.XLOOKUP($A2&M$1,'Submission Form'!$B$19:$B$114,'Submission Form'!$C$19:$C$114,\"\",0),IF(_xlpm.v=0,\"\",_xlpm.v))","v":""}]
["B",{"$f":"_xlfn.LET(_xlpm.v,_xlfn.XLOOKUP($A3&B$1,'Submission Form'!$B$19:$B$114,'Submission Form'!$C$19:$C$114,\"\",0),IF(_xlpm.v=0,\"\",_xlpm.v))","v":""},{"$f":"_xlfn.LET(_xlpm.v,_xlfn.XLOOKUP($A3&C$1,'Submission Form'!$B$19:$B$114,'Submission Form'!$C$19:$C$114,\"\",0),IF(_xlpm.v=0,\"\",_xlpm.v))","v":""},{"$f":"_xlfn.LET(_xlpm.v,_xlfn.XLOOKUP($A3&D$1,'Submission Form'!$B$19:$B$114,'Submission Form'!$C$19:$C$114,\"\",0),IF(_xlpm.v=0,\"\",_xlpm.v))","v":""},{"$f":"_xlfn.LET(_xlpm.v,_xlfn.XLOOKUP($A3&E$1,'Submission Form'!$B$19:$B$114,'Submission Form'!$C$19:$C$114,\"\",0),IF(_xlpm.v=0,\"\",_xlpm.v))","v":""},{"$f":"_xlfn.LET(_xlpm.v,_xlfn.XLOOKUP($A3&F$1,'Submission Form'!$B$19:$B$114,'Submission Form'!$C$19:$C$114,\"\",0),IF(_xlpm.v=0,\"\",_xlpm.v))","v":""},{"$f":"_xlfn.LET(_xlpm.v,_xlfn.XLOOKUP($A3&G$1,'Submission Form'!$B$19:$B$114,'Submission Form'!$C$19:$C$114,\"\",0),IF(_xlpm.v=0,\"\",_xlpm.v))","v":""},{"$f":"_xlfn.LET(_xlpm.v,_xlfn.XLOOKUP($A3&H$1,'Submission Form'!$B$19:$B$114,'Submission Form'!$C$19:$C$114,\"\",0),IF(_xlpm.v=0,\"\",_xlpm.v))","v":""},{"$f":"_xlfn.LET(_xlpm.v,_xlfn.XLOOKUP($A3&I$1,'Submission Form'!$B$19:$B$114,'Submission Form'!$C$19:$C$114,\"\",0),IF(_xlpm.v=0,\"\",_xlpm.v))","v":""},{"$f":"_xlfn.LET(_xlpm.v,_xlfn.XLOOKUP($A3&J$1,'Submission Form'!$B$19:$B$114,'Submission Form'!$C$19:$C$114,\"\",0),IF(_xlpm.v=0,\"\",_xlpm.v))","v":""},{"$f":"_xlfn.LET(_xlpm.v,_xlfn.XLOOKUP($A3&K$1,'Submission Form'!$B$19:$B$114,'Submission Form'!$C$19:$C$114,\"\",0),IF(_xlpm.v=0,\"\",_xlpm.v))","v":""},{"$f":"_xlfn.LET(_xlpm.v,_xlfn.XLOOKUP($A3&L$1,'Submission Form'!$B$19:$B$114,'Submission Form'!$C$19:$C$114,\"\",0),IF(_xlpm.v=0,\"\",_xlpm.v))","v":""},{"$f":"_xlfn.LET(_xlpm.v,_xlfn.XLOOKUP($A3&M$1,'Submission Form'!$B$19:$B$114,'Submission Form'!$C$19:$C$114,\"\",0),IF(_xlpm.v=0,\"\",_xlpm.v))","v":""}]
["C",{"$f":"_xlfn.LET(_xlpm.v,_xlfn.XLOOKUP($A4&B$1,'Submission Form'!$B$19:$B$114,'Submission Form'!$C$19:$C$114,\"\",0),IF(_xlpm.v=0,\"\",_xlpm.v))","v":""},{"$f":"_xlfn.LET(_xlpm.v,_xlfn.XLOOKUP($A4&C$1,'Submission Form'!$B$19:$B$114,'Submission Form'!$C$19:$C$114,\"\",0),IF(_xlpm.v=0,\"\",_xlpm.v))","v":""},{"$f":"_xlfn.LET(_xlpm.v,_xlfn.XLOOKUP($A4&D$1,'Submission Form'!$B$19:$B$114,'Submission Form'!$C$19:$C$114,\"\",0),IF(_xlpm.v=0,\"\",_xlpm.v))","v":""},{"$f":"_xlfn.LET(_xlpm.v,_xlfn.XLOOKUP($A4&E$1,'Submission Form'!$B$19:$B$114,'Submission Form'!$C$19:$C$114,\"\",0),IF(_xlpm.v=0,\"\",_xlpm.v))","v":""},{"$f":"_xlfn.LET(_xlpm.v,_xlfn.XLOOKUP($A4&F$1,'Submission Form'!$B$19:$B$114,'Submission Form'!$C$19:$C$114,\"\",0),IF(_xlpm.v=0,\"\",_xlpm.v))","v":""},{"$f":"_xlfn.LET(_xlpm.v,_xlfn.XLOOKUP($A4&G$1,'Submission Form'!$B$19:$B$114,'Submission Form'!$C$19:$C$114,\"\",0),IF(_xlpm.v=0,\"\",_xlpm.v))","v":""},{"$f":"_xlfn.LET(_xlpm.v,_xlfn.XLOOKUP($A4&H$1,'Submission Form'!$B$19:$B$114,'Submission Form'!$C$19:$C$114,\"\",0),IF(_xlpm.v=0,\"\",_xlpm.v))","v":""},{"$f":"_xlfn.LET(_xlpm.v,_xlfn.XLOOKUP($A4&I$1,'Submission Form'!$B$19:$B$114,'Submission Form'!$C$19:$C$114,\"\",0),IF(_xlpm.v=0,\"\",_xlpm.v))","v":""},{"$f":"_xlfn.LET(_xlpm.v,_xlfn.XLOOKUP($A4&J$1,'Submission Form'!$B$19:$B$114,'Submission Form'!$C$19:$C$114,\"\",0),IF(_xlpm.v=0,\"\",_xlpm.v))","v":""},{"$f":"_xlfn.LET(_xlpm.v,_xlfn.XLOOKUP($A4&K$1,'Submission Form'!$B$19:$B$114,'Submission Form'!$C$19:$C$114,\"\",0),IF(_xlpm.v=0,\"\",_xlpm.v))","v":""},{"$f":"_xlfn.LET(_xlpm.v,_xlfn.XLOOKUP($A4&L$1,'Submission Form'!$B$19:$B$114,'Submission Form'!$C$19:$C$114,\"\",0),IF(_xlpm.v=0,\"\",_xlpm.v))","v":""},{"$f":"_xlfn.LET(_xlpm.v,_xlfn.XLOOKUP($A4&M$1,'Submission Form'!$B$19:$B$114,'Submission Form'!$C$19:$C$114,\"\",0),IF(_xlpm.v=0,\"\",_xlpm.v))","v":""}]
["D",{"$f":"_xlfn.LET(_xlpm.v,_xlfn.XLOOKUP($A5&B$1,'Submission Form'!$B$19:$B$114,'Submission Form'!$C$19:$C$114,\"\",0),IF(_xlpm.v=0,\"\",_xlpm.v))","v":""},{"$f":"_xlfn.LET(_xlpm.v,_xlfn.XLOOKUP($A5&C$1,'Submission Form'!$B$19:$B$114,'Submission Form'!$C$19:$C$114,\"\",0),IF(_xlpm.v=0,\"\",_xlpm.v))","v":""},{"$f":"_xlfn.LET(_xlpm.v,_xlfn.XLOOKUP($A5&D$1,'Submission Form'!$B$19:$B$114,'Submission Form'!$C$19:$C$114,\"\",0),IF(_xlpm.v=0,\"\",_xlpm.v))","v":""},{"$f":"_xlfn.LET(_xlpm.v,_xlfn.XLOOKUP($A5&E$1,'Submission Form'!$B$19:$B$114,'Submission Form'!$C$19:$C$114,\"\",0),IF(_xlpm.v=0,\"\",_xlpm.v))","v":""},{"$f":"_xlfn.LET(_xlpm.v,_xlfn.XLOOKUP($A5&F$1,'Submission Form'!$B$19:$B$114,'Submission Form'!$C$19:$C$114,\"\",0),IF(_xlpm.v=0,\"\",_xlpm.v))","v":""},{"$f":"_xlfn.LET(_xlpm.v,_xlfn.XLOOKUP($A5&G$1,'Submission Form'!$B$19:$B$114,'Submission Form'!$C$19:$C$114,\"\",0),IF(_xlpm.v=0,\"\",_xlpm.v))","v":""},{"$f":"_xlfn.LET(_xlpm.v,_xlfn.XLOOKUP($A5&H$1,'Submission Form'!$B$19:$B$114,'Submission Form'!$C$19:$C$114,\"\",0),IF(_xlpm.v=0,\"\",_xlpm.v))","v":""},{"$f":"_xlfn.LET(_xlpm.v,_xlfn.XLOOKUP($A5&I$1,'Submission Form'!$B$19:$B$114,'Submission Form'!$C$19:$C$114,\"\",0),IF(_xlpm.v=0,\"\",_xlpm.v))","v":""},{"$f":"_xlfn.LET(_xlpm.v,_xlfn.XLOOKUP($A5&J$1,'Submission Form'!$B$19:$B$114,'Submission Form'!$C$19:$C$114,\"\",0),IF(_xlpm.v=0,\"\",_xlpm.v))","v":""},{"$f":"_xlfn.LET(_xlpm.v,_xlfn.XLOOKUP($A5&K$1,'Submission Form'!$B$19:$B$114,'Submission Form'!$C$19:$C$114,\"\",0),IF(_xlpm.v=0,\"\",_xlpm.v))","v":""},{"$f":"_xlfn.LET(_xlpm.v,_xlfn.XLOOKUP($A5&L$1,'Submission Form'!$B$19:$B$114,'Submission Form'!$C$19:$C$114,\"\",0),IF(_xlpm.v=0,\"\",_xlpm.v))","v":""},{"$f":"_xlfn.LET(_xlpm.v,_xlfn.XLOOKUP($A5&M$1,'Submission Form'!$B$19:$B$114,'Submission Form'!$C$19:$C$114,\"\",0),IF(_xlpm.v=0,\"\",_xlpm.v))","v":""}]
["E",{"$f":"_xlfn.LET(_xlpm.v,_xlfn.XLOOKUP($A6&B$1,'Submission Form'!$B$19:$B$114,'Submission Form'!$C$19:$C$114,\"\",0),IF(_xlpm.v=0,\"\",_xlpm.v))","v":""},{"$f":"_xlfn.LET(_xlpm.v,_xlfn.XLOOKUP($A6&C$1,'Submission Form'!$B$19:$B$114,'Submission Form'!$C$19:$C$114,\"\",0),IF(_xlpm.v=0,\"\",_xlpm.v))","v":""},{"$f":"_xlfn.LET(_xlpm.v,_xlfn.XLOOKUP($A6&D$1,'Submission Form'!$B$19:$B$114,'Submission Form'!$C$19:$C$114,\"\",0),IF(_xlpm.v=0,\"\",_xlpm.v))","v":""},{"$f":"_xlfn.LET(_xlpm.v,_xlfn.XLOOKUP($A6&E$1,'Submission Form'!$B$19:$B$114,'Submission Form'!$C$19:$C$114,\"\",0),IF(_xlpm.v=0,\"\",_xlpm.v))","v":""},{"$f":"_xlfn.LET(_xlpm.v,_xlfn.XLOOKUP($A6&F$1,'Submission Form'!$B$19:$B$114,'Submission Form'!$C$19:$C$114,\"\",0),IF(_xlpm.v=0,\"\",_xlpm.v))","v":""},{"$f":"_xlfn.LET(_xlpm.v,_xlfn.XLOOKUP($A6&G$1,'Submission Form'!$B$19:$B$114,'Submission Form'!$C$19:$C$114,\"\",0),IF(_xlpm.v=0,\"\",_xlpm.v))","v":""},{"$f":"_xlfn.LET(_xlpm.v,_xlfn.XLOOKUP($A6&H$1,'Submission Form'!$B$19:$B$114,'Submission Form'!$C$19:$C$114,\"\",0),IF(_xlpm.v=0,\"\",_xlpm.v))","v":""},{"$f":"_xlfn.LET(_xlpm.v,_xlfn.XLOOKUP($A6&I$1,'Submission Form'!$B$19:$B$114,'Submission Form'!$C$19:$C$114,\"\",0),IF(_xlpm.v=0,\"\",_xlpm.v))","v":""},{"$f":"_xlfn.LET(_xlpm.v,_xlfn.XLOOKUP($A6&J$1,'Submission Form'!$B$19:$B$114,'Submission Form'!$C$19:$C$114,\"\",0),IF(_xlpm.v=0,\"\",_xlpm.v))","v":""},{"$f":"_xlfn.LET(_xlpm.v,_xlfn.XLOOKUP($A6&K$1,'Submission Form'!$B$19:$B$114,'Submission Form'!$C$19:$C$114,\"\",0),IF(_xlpm.v=0,\"\",_xlpm.v))","v":""},{"$f":"_xlfn.LET(_xlpm.v,_xlfn.XLOOKUP($A6&L$1,'Submission Form'!$B$19:$B$114,'Submission Form'!$C$19:$C$114,\"\",0),IF(_xlpm.v=0,\"\",_xlpm.v))","v":""},{"$f":"_xlfn.LET(_xlpm.v,_xlfn.XLOOKUP($A6&M$1,'Submission Form'!$B$19:$B$114,'Submission Form'!$C$19:$C$114,\"\",0),IF(_xlpm.v=0,\"\",_xlpm.v))","v":""}]
["F",{"$f":"_xlfn.LET(_xlpm.v,_xlfn.XLOOKUP($A7&B$1,'Submission Form'!$B$19:$B$114,'Submission Form'!$C$19:$C$114,\"\",0),IF(_xlpm.v=0,\"\",_xlpm.v))","v":""},{"$f":"_xlfn.LET(_xlpm.v,_xlfn.XLOOKUP($A7&C$1,'Submission Form'!$B$19:$B$114,'Submission Form'!$C$19:$C$114,\"\",0),IF(_xlpm.v=0,\"\",_xlpm.v))","v":""},{"$f":"_xlfn.LET(_xlpm.v,_xlfn.XLOOKUP($A7&D$1,'Submission Form'!$B$19:$B$114,'Submission Form'!$C$19:$C$114,\"\",0),IF(_xlpm.v=0,\"\",_xlpm.v))","v":""},{"$f":"_xlfn.LET(_xlpm.v,_xlfn.XLOOKUP($A7&E$1,'Submission Form'!$B$19:$B$114,'Submission Form'!$C$19:$C$114,\"\",0),IF(_xlpm.v=0,\"\",_xlpm.v))","v":""},{"$f":"_xlfn.LET(_xlpm.v,_xlfn.XLOOKUP($A7&F$1,'Submission Form'!$B$19:$B$114,'Submission Form'!$C$19:$C$114,\"\",0),IF(_xlpm.v=0,\"\",_xlpm.v))","v":""},{"$f":"_xlfn.LET(_xlpm.v,_xlfn.XLOOKUP($A7&G$1,'Submission Form'!$B$19:$B$114,'Submission Form'!$C$19:$C$114,\"\",0),IF(_xlpm.v=0,\"\",_xlpm.v))","v":""},{"$f":"_xlfn.LET(_xlpm.v,_xlfn.XLOOKUP($A7&H$1,'Submission Form'!$B$19:$B$114,'Submission Form'!$C$19:$C$114,\"\",0),IF(_xlpm.v=0,\"\",_xlpm.v))","v":""},{"$f":"_xlfn.LET(_xlpm.v,_xlfn.XLOOKUP($A7&I$1,'Submission Form'!$B$19:$B$114,'Submission Form'!$C$19:$C$114,\"\",0),IF(_xlpm.v=0,\"\",_xlpm.v))","v":""},{"$f":"_xlfn.LET(_xlpm.v,_xlfn.XLOOKUP($A7&J$1,'Submission Form'!$B$19:$B$114,'Submission Form'!$C$19:$C$114,\"\",0),IF(_xlpm.v=0,\"\",_xlpm.v))","v":""},{"$f":"_xlfn.LET(_xlpm.v,_xlfn.XLOOKUP($A7&K$1,'Submission Form'!$B$19:$B$114,'Submission Form'!$C$19:$C$114,\"\",0),IF(_xlpm.v=0,\"\",_xlpm.v))","v":""},{"$f":"_xlfn.LET(_xlpm.v,_xlfn.XLOOKUP($A7&L$1,'Submission Form'!$B$19:$B$114,'Submission Form'!$C$19:$C$114,\"\",0),IF(_xlpm.v=0,\"\",_xlpm.v))","v":""},{"$f":"_xlfn.LET(_xlpm.v,_xlfn.XLOOKUP($A7&M$1,'Submission Form'!$B$19:$B$114,'Submission Form'!$C$19:$C$114,\"\",0),IF(_xlpm.v=0,\"\",_xlpm.v))","v":""}]
["G",{"$f":"_xlfn.LET(_xlpm.v,_xlfn.XLOOKUP($A8&B$1,'Submission Form'!$B$19:$B$114,'Submission Form'!$C$19:$C$114,\"\",0),IF(_xlpm.v=0,\"\",_xlpm.v))","v":""},{"$f":"_xlfn.LET(_xlpm.v,_xlfn.XLOOKUP($A8&C$1,'Submission Form'!$B$19:$B$114,'Submission Form'!$C$19:$C$114,\"\",0),IF(_xlpm.v=0,\"\",_xlpm.v))","v":""},{"$f":"_xlfn.LET(_xlpm.v,_xlfn.XLOOKUP($A8&D$1,'Submission Form'!$B$19:$B$114,'Submission Form'!$C$19:$C$114,\"\",0),IF(_xlpm.v=0,\"\",_xlpm.v))","v":""},{"$f":"_xlfn.LET(_xlpm.v,_xlfn.XLOOKUP($A8&E$1,'Submission Form'!$B$19:$B$114,'Submission Form'!$C$19:$C$114,\"\",0),IF(_xlpm.v=0,\"\",_xlpm.v))","v":""},{"$f":"_xlfn.LET(_xlpm.v,_xlfn.XLOOKUP($A8&F$1,'Submission Form'!$B$19:$B$114,'Submission Form'!$C$19:$C$114,\"\",0),IF(_xlpm.v=0,\"\",_xlpm.v))","v":""},{"$f":"_xlfn.LET(_xlpm.v,_xlfn.XLOOKUP($A8&G$1,'Submission Form'!$B$19:$B$114,'Submission Form'!$C$19:$C$114,\"\",0),IF(_xlpm.v=0,\"\",_xlpm.v))","v":""},{"$f":"_xlfn.LET(_xlpm.v,_xlfn.XLOOKUP($A8&H$1,'Submission Form'!$B$19:$B$114,'Submission Form'!$C$19:$C$114,\"\",0),IF(_xlpm.v=0,\"\",_xlpm.v))","v":""},{"$f":"_xlfn.LET(_xlpm.v,_xlfn.XLOOKUP($A8&I$1,'Submission Form'!$B$19:$B$114,'Submission Form'!$C$19:$C$114,\"\",0),IF(_xlpm.v=0,\"\",_xlpm.v))","v":""},{"$f":"_xlfn.LET(_xlpm.v,_xlfn.XLOOKUP($A8&J$1,'Submission Form'!$B$19:$B$114,'Submission Form'!$C$19:$C$114,\"\",0),IF(_xlpm.v=0,\"\",_xlpm.v))","v":""},{"$f":"_xlfn.LET(_xlpm.v,_xlfn.XLOOKUP($A8&K$1,'Submission Form'!$B$19:$B$114,'Submission Form'!$C$19:$C$114,\"\",0),IF(_xlpm.v=0,\"\",_xlpm.v))","v":""},{"$f":"_xlfn.LET(_xlpm.v,_xlfn.XLOOKUP($A8&L$1,'Submission Form'!$B$19:$B$114,'Submission Form'!$C$19:$C$114,\"\",0),IF(_xlpm.v=0,\"\",_xlpm.v))","v":""},{"$f":"_xlfn.LET(_xlpm.v,_xlfn.XLOOKUP($A8&M$1,'Submission Form'!$B$19:$B$114,'Submission Form'!$C$19:$C$114,\"\",0),IF(_xlpm.v=0,\"\",_xlpm.v))","v":""}]
["H",{"$f":"_xlfn.LET(_xlpm.v,_xlfn.XLOOKUP($A9&B$1,'Submission Form'!$B$19:$B$114,'Submission Form'!$C$19:$C$114,\"\",0),IF(_xlpm.v=0,\"\",_xlpm.v))","v":""},{"$f":"_xlfn.LET(_xlpm.v,_xlfn.XLOOKUP($A9&C$1,'Submission Form'!$B$19:$B$114,'Submission Form'!$C$19:$C$114,\"\",0),IF(_xlpm.v=0,\"\",_xlpm.v))","v":""},{"$f":"_xlfn.LET(_xlpm.v,_xlfn.XLOOKUP($A9&D$1,'Submission Form'!$B$19:$B$114,'Submission Form'!$C$19:$C$114,\"\",0),IF(_xlpm.v=0,\"\",_xlpm.v))","v":""},{"$f":"_xlfn.LET(_xlpm.v,_xlfn.XLOOKUP($A9&E$1,'Submission Form'!$B$19:$B$114,'Submission Form'!$C$19:$C$114,\"\",0),IF(_xlpm.v=0,\"\",_xlpm.v))","v":""},{"$f":"_xlfn.LET(_xlpm.v,_xlfn.XLOOKUP($A9&F$1,'Submission Form'!$B$19:$B$114,'Submission Form'!$C$19:$C$114,\"\",0),IF(_xlpm.v=0,\"\",_xlpm.v))","v":""},{"$f":"_xlfn.LET(_xlpm.v,_xlfn.XLOOKUP($A9&G$1,'Submission Form'!$B$19:$B$114,'Submission Form'!$C$19:$C$114,\"\",0),IF(_xlpm.v=0,\"\",_xlpm.v))","v":""},{"$f":"_xlfn.LET(_xlpm.v,_xlfn.XLOOKUP($A9&H$1,'Submission Form'!$B$19:$B$114,'Submission Form'!$C$19:$C$114,\"\",0),IF(_xlpm.v=0,\"\",_xlpm.v))","v":""},{"$f":"_xlfn.LET(_xlpm.v,_xlfn.XLOOKUP($A9&I$1,'Submission Form'!$B$19:$B$114,'Submission Form'!$C$19:$C$114,\"\",0),IF(_xlpm.v=0,\"\",_xlpm.v))","v":""},{"$f":"_xlfn.LET(_xlpm.v,_xlfn.XLOOKUP($A9&J$1,'Submission Form'!$B$19:$B$114,'Submission Form'!$C$19:$C$114,\"\",0),IF(_xlpm.v=0,\"\",_xlpm.v))","v":""},{"$f":"_xlfn.LET(_xlpm.v,_xlfn.XLOOKUP($A9&K$1,'Submission Form'!$B$19:$B$114,'Submission Form'!$C$19:$C$114,\"\",0),IF(_xlpm.v=0,\"\",_xlpm.v))","v":""},{"$f":"_xlfn.LET(_xlpm.v,_xlfn.XLOOKUP($A9&L$1,'Submission Form'!$B$19:$B$114,'Submission Form'!$C$19:$C$114,\"\",0),IF(_xlpm.v=0,\"\",_xlpm.v))","v":""},{"$f":"_xlfn.LET(_xlpm.v,_xlfn.XLOOKUP($A9&M$1,'Submission Form'!$B$19:$B$114,'Submission Form'!$C$19:$C$114,\"\",0),IF(_xlpm.v=0,\"\",_xlpm.v))","v":""}]